Participant,Timestamp,Please do not change. This field is auto-populated by the PGP and identifies which participant you are.,"Since Jan 1, 2020, have you been ill with a cold or flu-like illness? ",Currently are you experiencing ANY of the above list of symptoms?,"Indicate which of the following symptoms you are currently experiencing.   [Persistent high fever of 38°C (100.4°F) or higher, lasting for a day or more]","Indicate which of the following symptoms you are currently experiencing.   [Feeling cold, chills or shivers]",Indicate which of the following symptoms you are currently experiencing.   [Headache],Indicate which of the following symptoms you are currently experiencing.   [Aches all over the body],Indicate which of the following symptoms you are currently experiencing.   [Cough],Indicate which of the following symptoms you are currently experiencing.   [Rapid breathing],Indicate which of the following symptoms you are currently experiencing.   [Shortness of breath],Indicate which of the following symptoms you are currently experiencing.   [Wheezing or chest tightness],Indicate which of the following symptoms you are currently experiencing.   [Persistent pain or pressure in the chest],Indicate which of the following symptoms you are currently experiencing.   [Bluish lips or face],Indicate which of the following symptoms you are currently experiencing.   [Dizziness],Indicate which of the following symptoms you are currently experiencing.   [Confusion or inability to arouse],Indicate which of the following symptoms you are currently experiencing.   [Running nose],Indicate which of the following symptoms you are currently experiencing.   [Sore throat],Indicate which of the following symptoms you are currently experiencing.   [Nausea],Indicate which of the following symptoms you are currently experiencing.   [Vomiting],Indicate which of the following symptoms you are currently experiencing.   [Abdominal Pain],Indicate which of the following symptoms you are currently experiencing.   [Diarrhea],Indicate which of the following symptoms you are currently experiencing.   [Pink eye (conjunctivitis)],Indicate which of the following symptoms you are currently experiencing.   [Loss of sense of smell],Indicate which of the following symptoms you are currently experiencing.   [Loss of sense of taste],"In the past two weeks, have you experienced ANY of the above list of symptoms?","In the past 2 weeks,  which symptoms have you experienced. [Persistent high fever of 38°C (100.4°F) or higher, lasting for a day or more]","In the past 2 weeks,  which symptoms have you experienced. [Feeling cold, chills or shivers]","In the past 2 weeks,  which symptoms have you experienced. [Headache]","In the past 2 weeks,  which symptoms have you experienced. [Aches all over the body]","In the past 2 weeks,  which symptoms have you experienced. [Cough]","In the past 2 weeks,  which symptoms have you experienced. [Rapid breathing]","In the past 2 weeks,  which symptoms have you experienced. [Shortness of breath]","In the past 2 weeks,  which symptoms have you experienced. [Wheezing or chest tightness]","In the past 2 weeks,  which symptoms have you experienced. [Persistent pain or pressure in the chest]","In the past 2 weeks,  which symptoms have you experienced. [Bluish lips or face]","In the past 2 weeks,  which symptoms have you experienced. [Dizziness]","In the past 2 weeks,  which symptoms have you experienced. [Confusion or inability to arouse]","In the past 2 weeks,  which symptoms have you experienced. [Running nose]","In the past 2 weeks,  which symptoms have you experienced. [Sore throat]","In the past 2 weeks,  which symptoms have you experienced. [Nausea]","In the past 2 weeks,  which symptoms have you experienced. [Vomiting]","In the past 2 weeks,  which symptoms have you experienced. [Abdominal pain]","In the past 2 weeks,  which symptoms have you experienced. [Diarrhea]","In the past 2 weeks,  which symptoms have you experienced. [Pink eye (conjunctivitis)]","In the past 2 weeks,  which symptoms have you experienced. [Loss of sense of smell]","In the past 2 weeks,  which symptoms have you experienced. [Loss of sense of taste]","Since Jan 1, 2020, to the best of your recollection,have you experienced ANY of the above list of symptoms?","Since Jan 1, 2020, to the best of your recollection which symptoms have you experienced. [Persistent high fever of 38°C (100.4°F) or higher, lasting for a day or more]","Since Jan 1, 2020, to the best of your recollection which symptoms have you experienced. [Feeling cold, chills or shivers]","Since Jan 1, 2020, to the best of your recollection which symptoms have you experienced. [Headache]","Since Jan 1, 2020, to the best of your recollection which symptoms have you experienced. [Aches all over the body]","Since Jan 1, 2020, to the best of your recollection which symptoms have you experienced. [Cough]","Since Jan 1, 2020, to the best of your recollection which symptoms have you experienced. [Rapid breathing]","Since Jan 1, 2020, to the best of your recollection which symptoms have you experienced. [Shortness of breath]","Since Jan 1, 2020, to the best of your recollection which symptoms have you experienced. [Wheezing or chest tightness]","Since Jan 1, 2020, to the best of your recollection which symptoms have you experienced. [Persistent pain or pressure in the chest]","Since Jan 1, 2020, to the best of your recollection which symptoms have you experienced. [Bluish lips or face]","Since Jan 1, 2020, to the best of your recollection which symptoms have you experienced. [Dizziness]","Since Jan 1, 2020, to the best of your recollection which symptoms have you experienced. [Confusion or inability to arouse]","Since Jan 1, 2020, to the best of your recollection which symptoms have you experienced. [Running nose]","Since Jan 1, 2020, to the best of your recollection which symptoms have you experienced. [Sore throat]","Since Jan 1, 2020, to the best of your recollection which symptoms have you experienced. [Nausea]","Since Jan 1, 2020, to the best of your recollection which symptoms have you experienced. [Vomiting]","Since Jan 1, 2020, to the best of your recollection which symptoms have you experienced. [Abdominal pain]","Since Jan 1, 2020, to the best of your recollection which symptoms have you experienced. [Diarrhea]","Since Jan 1, 2020, to the best of your recollection which symptoms have you experienced. [Pink eye (conjunctivitis)]","Since Jan 1, 2020, to the best of your recollection which symptoms have you experienced. [Loss of sense of smell]","Since Jan 1, 2020, to the best of your recollection which symptoms have you experienced. [Loss of sense of taste]",Are you regularly taking any of the following medications? Please choose all those that apply.,Have you been tested for coronavirus (COVID-19) by a medical doctor or other official testing service?,"In the past 4 weeks, have you been in close contact with a person who has tested positive for coronavirus (COVID-19)?",How long ago was your contact with a person who has tested positive for coronavirus (COVID-19)?,"In the past 4 weeks, have you been in close contact with a person who has symptoms consistent with coronavirus (COVID-19) but has not been tested?",How long ago was your contact with a person who has symptoms consistent with coronavirus (COVID-19) but has not been tested?
hu826BC6,4/6/2020 13:42:33,ragxzad9tcni3l4uusvbywrkhmaks034edd1qpvaw1d0wmody,No,No,,,,,,,,,,,,,,,,,,,,,,No,,,,,,,,,,,,,,,,,,,,,,No,,,,,,,,,,,,,,,,,,,,,,None of these medications,"No, I have not tried to get tested",No,,No,
huBEA3C8,4/6/2020 13:43:09,pjacowvk63nrutfqj5fp38koopbwd2lq2f51ewxr8sjjmi6p9,No,No,,,,,,,,,,,,,,,,,,,,,,No,,,,,,,,,,,,,,,,,,,,,,No,,,,,,,,,,,,,,,,,,,,,,"Ibuprofen (eg. Advil, Midol, Motrin, Motrin IB, Motrin Migraine Pain, Proprinal)","No, I have not tried to get tested",No,,No,
huE9D25C,4/6/2020 13:43:31,y30w70kxibw50l4sfd8pk9k6g4kpkkmtigy9xtlyhn3hff4ld,Yes,No,,,,,,,,,,,,,,,,,,,,,,No,,,,,,,,,,,,,,,,,,,,,,Yes,No,No,Yes,Yes,Yes,No,No,Yes,No,No,No,No,No,Yes,No,No,No,No,No,No,No,None of these medications,"No, I have not tried to get tested",No,,No,
huE6678A,4/6/2020 13:44:12,12m7tdvdae9qk0u0q8nam613k1vujtfx3bqhpndsoc7786rmwq,No,No,,,,,,,,,,,,,,,,,,,,,,No,,,,,,,,,,,,,,,,,,,,,,No,,,,,,,,,,,,,,,,,,,,,,None of these medications,"No, I have not tried to get tested",No,,No,
hu9D78A5,4/6/2020 13:44:48,1p6ziiu1kxjtmn7aw9uj8bzgrqz38gnm4fi99fwbqyepkxtdtl,Yes,No,,,,,,,,,,,,,,,,,,,,,,No,,,,,,,,,,,,,,,,,,,,,,Yes,No,Yes,Yes,No,Yes,No,No,No,No,No,No,No,Yes,Yes,No,No,No,No,No,No,No,None of these medications,"No, I tried to get tested but could not get a test",No,,No,
hu065B67,4/6/2020 13:44:54,5j46hwu991hoafocfyzvzkcqhwfp4myu9z039qifq7b98wru00,Yes,Yes,No,No,No,No,No,No,No,No,No,No,No,No,No,Yes,No,No,No,No,No,No,No,No,,,,,,,,,,,,,,,,,,,,,,Yes,No,No,Yes,No,No,No,No,No,No,No,No,No,No,Yes,No,No,No,No,No,No,No,None of these medications,"No, I have not tried to get tested",No,,No,
hu63EB0A,4/6/2020 13:45:08,5aozb5wnvaywlq5y1553hi24ro43l3xe5onp5t9xuwb6vqesng,No,No,,,,,,,,,,,,,,,,,,,,,,No,,,,,,,,,,,,,,,,,,,,,,No,,,,,,,,,,,,,,,,,,,,,,None of these medications,"No, I have not tried to get tested",No,,No,
hu462410,4/6/2020 13:45:32,4yxrfylabvpk1yo7i5a1vsx1eyzy6qt42kyrpx25p9crkp8k20,Yes,Yes,,,,,Yes,,,,,,,,Yes,,,,,,,,,Yes,,,,,Yes,,,,,,,,Yes,,,,,,,,,Yes,Yes,,Yes,,Yes,,,,,,,,Yes,,,,,,,,,None of these medications,"No, I have not tried to get tested",No,,No,
hu55E69B,4/6/2020 13:46:37,18nulll59v047hzki0hab5ftn54k48hjse98o7m17puu8lsnmp,Yes,No,,,,,,,,,,,,,,,,,,,,,,Yes,No,No,No,No,No,No,No,No,No,No,No,No,Yes,No,No,No,No,No,No,No,No,,,,,,,,,,,,,,,,,,,,,,,None of these medications,"No, I have not tried to get tested",No,,No,
hu9AE5EE,4/6/2020 13:46:46,26317120jmxsatpnqblcz38iow66ye32lm9i1rw8f1en66nwku,No,No,,,,,,,,,,,,,,,,,,,,,,No,,,,,,,,,,,,,,,,,,,,,,No,,,,,,,,,,,,,,,,,,,,,,None of these medications,"No, I have not tried to get tested",No,,No,
hu17410A,4/6/2020 13:46:52,4j006syeix513kpfn0kcb3kkcfak4agb7i67kr0a9ruhr1z41b,Yes,Yes,No,Yes,Yes,Yes,Yes,No,Yes,Yes,No,No,No,No,Yes,No,Yes,No,No,No,No,No,No,Yes,Yes,Yes,Yes,Yes,Yes,No,Yes,Yes,No,No,No,No,Yes,Yes,Yes,No,Yes,Yes,No,No,No,Yes,Yes,Yes,Yes,Yes,Yes,No,Yes,Yes,No,No,Yes,No,Yes,Yes,Yes,No,No,Yes,No,No,No,losartan (e.g. Cozaar),"No, I have not tried to get tested",No,,No,
huA3BBD3,4/6/2020 13:47:16,45xkgrnk7nn14yrftl1kn02s0ltrg6mg0mvuwm0y4uue0vxw6w,No,No,,,,,,,,,,,,,,,,,,,,,,Yes,No,No,Yes,No,No,No,No,No,No,No,No,No,No,Yes,No,No,No,Yes,No,No,No,Yes,No,No,Yes,No,No,No,No,No,No,No,No,No,No,Yes,No,No,No,Yes,No,No,No,None of these medications,"No, I have not tried to get tested",No,,No,
hu948494,4/6/2020 13:47:29,4cfwsul6iole1llr6mkb62kp6hfz4osogl0f32aep7k6jaqghb,No,No,,,,,,,,,,,,,,,,,,,,,,No,,,,,,,,,,,,,,,,,,,,,,No,,,,,,,,,,,,,,,,,,,,,,Do not know,"No, I have not tried to get tested",No,,No,
hu45BAB6,4/6/2020 13:47:53,2wruiz9l8nh9ubetxvyg5i6779f4wpcswlg4s881lejf9dajgg,No,No,,,,,,,,,,,,,,,,,,,,,,No,,,,,,,,,,,,,,,,,,,,,,Yes,No,Yes,Yes,No,Yes,No,Yes,Yes,No,No,No,No,Yes,No,Yes,No,No,Yes,No,No,No,None of these medications,"No, I have not tried to get tested",No,,No,
huC3160A,4/6/2020 13:48:05,2skjcpuhqftngwf2lz1wo5obfmlatthxgu88t7r9c0f2pczx4s,No,No,,,,,,,,,,,,,,,,,,,,,,No,,,,,,,,,,,,,,,,,,,,,,No,,,,,,,,,,,,,,,,,,,,,,None of these medications,"No, I have not tried to get tested",No,,No,
hu2FBC1E,4/6/2020 13:48:09,5foc0qfdy1gf8p1ihfob9f5hqsi5g27bvciujqs62ze43790ah,Yes,No,,,,,,,,,,,,,,,,,,,,,,Yes,No,No,No,No,Yes,No,No,,No,No,No,No,No,Yes,No,No,No,No,No,No,No,Yes,No,No,No,No,Yes,No,No,No,No,No,No,No,No,Yes,No,No,No,No,No,No,No,None of these medications,"Yes, and the test was negative for coronavirus (COVID-19)",No,,Yes,Over 2 weeks
huA5FD8B,4/6/2020 13:48:17,i0llwzjt01teehdzffprt2alpldhkac35kmpu493yszb0xu7z,Yes,Yes,No,No,Yes,Yes,No,No,No,No,No,No,Yes,No,No,No,No,No,No,No,No,No,No,Yes,No,No,Yes,Yes,No,No,No,No,No,No,Yes,No,No,No,No,No,No,No,No,No,No,Yes,No,No,No,Yes,No,No,No,No,No,No,Yes,No,No,Yes,No,No,No,No,No,No,No,"Ibuprofen (eg. Advil, Midol, Motrin, Motrin IB, Motrin Migraine Pain, Proprinal)","No, I have not tried to get tested",not known,,,
hu728164,4/6/2020 13:48:40,5ze0nxu6nicjqh5ns7ym1abtyecx9ek401yh56tf9cin5ar9km,No,No,,,,,,,,,,,,,,,,,,,,,,No,,,,,,,,,,,,,,,,,,,,,,No,,,,,,,,,,,,,,,,,,,,,,None of these medications,"No, I have not tried to get tested",No,,No,
hu264A0A,4/6/2020 13:49:09,2baei6gnslhdimrt1i9nbsp7vzf54igaptv4adbo7dtddia3ty,Yes,No,,,,,,,,,,,,,,,,,,,,,,Yes,No,No,No,No,No,No,No,No,No,No,No,No,No,No,Yes,No,No,No,No,No,No,Yes,No,Yes,No,Yes,No,No,No,No,Yes,No,No,No,No,No,Yes,No,No,Yes,No,No,No,None of these medications,"No, I have not tried to get tested",No,,No,
hu399FC0,4/6/2020 13:49:29,5y93u0072fqb02n85o8wi8olz883v0nvuzcvb7uwe2sy6tr49n,No,Yes,No,No,No,No,No,No,No,No,No,No,No,No,Yes,No,No,No,No,No,No,No,No,Yes,No,No,No,No,No,No,No,No,No,No,No,No,Yes,No,No,No,No,No,No,No,No,Yes,No,No,No,No,No,No,No,No,No,No,No,No,Yes,No,No,No,No,No,No,No,No,None of these medications,"No, I have not tried to get tested",No,,No,
huB828CB,4/6/2020 13:49:29,61gijj0dvep7hgafo25v4k5wy91bi2krh2laww6fzzby5zi1gp,Yes,No,,,,,,,,,,,,,,,,,,,,,,No,,,,,,,,,,,,,,,,,,,,,,Yes,Unknown,Yes,Yes,Yes,Yes,No,No,No,No,No,No,No,Yes,Yes,Yes,Yes,No,Yes,No,No,No,None of these medications,"No, I have not tried to get tested",No,,No,
hu33F781,4/6/2020 13:50:06,5cufs5ffuwi5t2o8d1mde51ffi5ux64m20fd4v3uqyzau92zt0,No,No,,,,,,,,,,,,,,,,,,,,,,No,,,,,,,,,,,,,,,,,,,,,,No,,,,,,,,,,,,,,,,,,,,,,None of these medications,"No, I have not tried to get tested",No,,No,
hu9408BD,4/6/2020 13:50:21,dlix3du18124io0c3bdbj1ib92rwhrtfhbtq3mkc12bx7bvxf,No,No,,,,,,,,,,,,,,,,,,,,,,No,,,,,,,,,,,,,,,,,,,,,,No,,,,,,,,,,,,,,,,,,,,,,None of these medications,"No, I have not tried to get tested",No,,No,
huD25FE3,4/6/2020 13:50:29,y2pesve9wf2uyfka0vt52f233jfdx5a15kqt3w2ttjkdxqtbv,No,No,,,,,,,,,,,,,,,,,,,,,,No,,,,,,,,,,,,,,,,,,,,,,No,,,,,,,,,,,,,,,,,,,,,,None of these medications,"No, I have not tried to get tested",Not that I know of,,,
hu6E8157,4/6/2020 13:50:35,4f4xgkyem2acjipocaeyjblqpb5y80p5vuroi6j7dwk9lkfrkm,Yes,No,,,,,,,,,,,,,,,,,,,,,,No,,,,,,,,,,,,,,,,,,,,,,Yes,Unknown,Yes,Yes,Yes,Yes,No,Yes,,Yes,Unknown,Yes,Unknown,Yes,Yes,Yes,Unknown,No,Yes,Unknown,Unknown,Unknown,None of these medications,"No, I have not tried to get tested","I believe I was infected with coronavirus around 1st week of Jan 2020 and that my wife was shortly thereafter (caught from me or possibly while we were both in Italy)  Her symptoms resolved about 6 weeks ago, but I have been in close contact with her continuously since Jan 2020 to the present.",,,
hu4BF398,4/6/2020 13:50:38,ii0xofdfc7mg4bvhke0d8peg7d8f8x7wehnm1mc1i2506fxz0,No,No,,,,,,,,,,,,,,,,,,,,,,No,,,,,,,,,,,,,,,,,,,,,,No,,,,,,,,,,,,,,,,,,,,,,None of these medications,"No, I have not tried to get tested",No,,No,
hu27E03F,4/6/2020 13:50:42,re3aqg3u2i1cvh7nsqfla9hpal6wmab34uxzyziq22mdlj5o2,Yes,No,,,,,,,,,,,,,,,,,,,,,,No,,,,,,,,,,,,,,,,,,,,,,Yes,Unknown,Yes,Yes,Yes,Yes,No,Yes,Yes,Yes,No,No,No,Yes,Yes,No,No,No,No,No,No,No,None of these medications,"No, I have not tried to get tested",Yes,Over 2 weeks,Yes,Over 2 weeks
hu474D66,4/6/2020 13:50:47,167knsdaqmhyedmkud64txvd3922ajo5f6gw4wc5miwzonm3e6,Yes,No,,,,,,,,,,,,,,,,,,,,,,Yes,No,No,Yes,No,No,No,Yes,No,No,No,No,No,Yes,Yes,No,No,No,Yes,No,No,No,Yes,No,No,Yes,No,Yes,No,Yes,No,No,No,No,No,Yes,Yes,Yes,No,No,Yes,No,No,No,None of these medications,"No, I have not tried to get tested",No,,No,
hu655EB3,4/6/2020 13:50:52,4ym8vy7tt1ymutkrjg0ak7ix8i75b1djtglbuqnklezuc5713d,No,No,,,,,,,,,,,,,,,,,,,,,,No,,,,,,,,,,,,,,,,,,,,,,No,,,,,,,,,,,,,,,,,,,,,,None of these medications,"No, I have not tried to get tested",No,,No,
hu9E8595,4/6/2020 13:51:13,4wyivg27f8nsa1mm1yl3ud9x64qtozygnxai2ixf6pdkucg3tr,No,No,,,,,,,,,,,,,,,,,,,,,,No,,,,,,,,,,,,,,,,,,,,,,No,,,,,,,,,,,,,,,,,,,,,,None of these medications,"No, I have not tried to get tested",No,,No,
huE24522,4/6/2020 13:51:20,2p65kjun0ueatcsodxczvvk9o7eeyghoskmp5lo6zj51uywydz,No,No,,,,,,,,,,,,,,,,,,,,,,No,,,,,,,,,,,,,,,,,,,,,,No,,,,,,,,,,,,,,,,,,,,,,None of these medications,"No, I have not tried to get tested",No,,No,
huD4DDF9,4/6/2020 13:51:22,li4d0e0ljc42zzlt4sn2vpmaow4nogz939qxyum9xm3wbr6fh,Yes,No,,,,,,,,,,,,,,,,,,,,,,No,,,,,,,,,,,,,,,,,,,,,,Yes,No,No,Yes,No,Yes,No,No,No,No,No,No,No,Yes,Yes,No,No,No,No,No,No,No,None of these medications,"No, I have not tried to get tested",Yes,Over 2 weeks,No,
huA05317,4/6/2020 13:51:23,yzx31yqzixzmjosnz3roedxoe6n1tywef4acghjuz6xudf24z,No,No,,,,,,,,,,,,,,,,,,,,,,No,,,,,,,,,,,,,,,,,,,,,,No,,,,,,,,,,,,,,,,,,,,,,None of these medications,"No, I have not tried to get tested",Do not know,,,
huAB3A35,4/6/2020 13:51:48,66m1ujwjgz2q21g04gtkdhdz5bbrsq2hstgi6a1m1skho1z4wx,No,No,,,,,,,,,,,,,,,,,,,,,,Yes,No,No,Yes,Unknown,No,No,No,No,No,No,No,No,No,No,Yes,Yes,No,Yes,No,No,No,Yes,No,No,Yes,No,No,No,No,No,No,No,No,No,No,No,Yes,Yes,No,Yes,No,No,No,None of these medications,"No, I have not tried to get tested",No,,No,
hu8B54DD,4/6/2020 13:52:11,2kx75nyd1mi01fliqwkq9wyuoezvzfi6ld1do1rswyvrh3gfxt,Yes,No,,,,,,,,,,,,,,,,,,,,,,Yes,No,No,Yes,No,No,No,No,No,No,No,No,No,Yes,No,No,No,No,No,No,No,No,Yes,Yes,Yes,Yes,Yes,Yes,No,No,No,No,No,No,No,Yes,Yes,Yes,No,No,Yes,No,No,Yes,"Ibuprofen (eg. Advil, Midol, Motrin, Motrin IB, Motrin Migraine Pain, Proprinal)","No, I have not tried to get tested",No,,No,
huB3A31B,4/6/2020 13:52:34,2nxm9niti5wtedy1r5ru76vraikwwaz4q37q82uy1zt93du0mu,No,No,,,,,,,,,,,,,,,,,,,,,,Yes,No,No,Yes,No,No,No,No,No,No,No,No,No,Yes,No,Yes,No,No,No,No,No,No,Yes,No,No,Yes,No,No,No,No,No,No,No,No,No,Yes,No,Yes,Yes,No,No,No,No,No,None of these medications,"No, I have not tried to get tested",No,,No,
hu6642CE,4/6/2020 13:52:36,rzrkg6c43etcg0n4696cgu53p4a49p549hkqqkmeo8ndu7me9,No,No,,,,,,,,,,,,,,,,,,,,,,No,,,,,,,,,,,,,,,,,,,,,,No,,,,,,,,,,,,,,,,,,,,,,None of these medications,"No, I have not tried to get tested",No,,No,
huDD642E,4/6/2020 13:52:40,4wl14bu9gohwmf2p3df8e0zksxncjq3bf4845rqlo60ltnejql,Yes,No,,,,,,,,,,,,,,,,,,,,,,No,,,,,,,,,,,,,,,,,,,,,,Yes,Yes,Yes,Yes,Yes,Yes,,Yes,,,,Yes,Yes,Yes,Yes,Yes,,,Yes,,,Yes,None of these medications,"No, I have not tried to get tested",No,,No,
huE80E3D,4/6/2020 13:53:02,2tu6xypc5jwxlj3x2vldft0ttie1jmrf56hdq19f18akadoryf,Yes,No,,,,,,,,,,,,,,,,,,,,,,No,,,,,,,,,,,,,,,,,,,,,,Yes,No,Yes,Yes,No,No,No,No,No,No,No,No,No,Yes,Yes,Yes,No,Yes,Yes,Yes,No,No,"Ibuprofen (eg. Advil, Midol, Motrin, Motrin IB, Motrin Migraine Pain, Proprinal)","No, I have not tried to get tested",No,,No,
hu30888B,4/6/2020 13:53:42,mcuyxne04opl3izy8msne1clyc62kdw6ptl6ghw3go4u4e41p,No,No,,,,,,,,,,,,,,,,,,,,,,No,,,,,,,,,,,,,,,,,,,,,,Yes,No,No,Yes,No,No,No,No,Yes,No,No,No,No,Yes,No,No,No,No,Yes,No,No,No,Telmisartan (e.g. Micardis),"No, I have not tried to get tested",No,,No,
hu474D66,4/6/2020 13:54:06,2asowhxgpdb2pvg2v1ll10pn1yplfuhsc9q99tz3zvvk6lesyq,Yes,No,,,,,,,,,,,,,,,,,,,,,,Yes,No,Yes,No,No,Yes,No,Yes,No,No,No,No,No,Yes,Yes,No,No,No,Yes,No,No,No,Yes,No,Yes,Yes,No,Yes,No,Yes,No,No,No,No,No,Yes,Yes,Yes,No,No,Yes,No,No,No,None of these medications,"No, I have not tried to get tested",No,,No,
huAF3C63,4/6/2020 13:54:08,1cqmuw6iw769ndvvnumwl4sq797dwlh5bv9mja6sctwrzhidlx,Yes,Yes,No,No,No,No,No,No,No,No,No,No,No,No,No,No,No,No,No,Yes,No,No,No,Yes,No,Yes,No,No,No,No,Yes,No,No,No,No,No,No,Yes,No,No,No,Yes,No,No,No,Yes,No,Yes,No,Yes,No,No,Yes,No,No,No,No,No,No,Yes,No,No,No,Yes,No,No,No,"iron supplements, calcium supplements, multivitamin supplements","No, I have not tried to get tested",No,,No,
huA11006,4/6/2020 13:54:08,1tvy0c0yugqn2knxsog9qrsc9wrtdzahml1fqjd82j8y8wlhay,Yes,Yes,No,No,No,Yes,No,No,No,No,No,No,No,No,No,No,No,No,No,Yes,No,No,No,Yes,No,No,Yes,Yes,Yes,No,No,No,No,No,No,No,No,No,No,No,No,Yes,No,No,No,Yes,Yes,Yes,Yes,Yes,Yes,Yes,Yes,Yes,No,No,No,No,Yes,Yes,Yes,Yes,No,Yes,No,No,No,None of these medications,"No, I tried to get tested but could not get a test",I was in contact with the children of a person who tested positive,,,
huF80AA5,4/6/2020 13:54:24,5upiuvdlzacy1q4ojk2n6tvfsa05aq9innsp65m6v54tdq0tse,No,No,,,,,,,,,,,,,,,,,,,,,,No,,,,,,,,,,,,,,,,,,,,,,No,,,,,,,,,,,,,,,,,,,,,,None of these medications,"No, I have not tried to get tested",No,,No,
huCDD5EE,4/6/2020 13:54:56,13ynr9fc8jv33tfxkgzt0670i0fh18c0cyb6o8uwoj2uug9c2h,No,No,,,,,,,,,,,,,,,,,,,,,,No,,,,,,,,,,,,,,,,,,,,,,No,,,,,,,,,,,,,,,,,,,,,,None of these medications,"No, I have not tried to get tested",No,,No,
huA38896,4/6/2020 13:55:00,7z3re6wda6xgcc60rwadncskx88vryshhzo8qddg6w2c5ur18,No,No,,,,,,,,,,,,,,,,,,,,,,No,,,,,,,,,,,,,,,,,,,,,,No,,,,,,,,,,,,,,,,,,,,,,None of these medications,"No, I have not tried to get tested",No,,No,
hu00445D,4/6/2020 13:55:03,3izsjgzc022fmqth9xzih45y1aumzsrc5kkwuojx284usybwry,No,No,,,,,,,,,,,,,,,,,,,,,,No,,,,,,,,,,,,,,,,,,,,,,No,,,,,,,,,,,,,,,,,,,,,,None of these medications,"No, I have not tried to get tested",No,,No,
hu2EA6EA,4/6/2020 13:55:04,4hbs22bmmwjcwemelm5qzrg2qnr1ff8vbs3p41u65n7u5hayoe,Unknown,Yes,No,No,No,No,No,No,No,No,No,No,No,No,No,Yes,No,No,No,No,No,No,No,Yes,No,No,No,No,No,No,No,No,No,No,No,No,,Yes,No,No,No,No,No,No,No,Yes,No,No,No,No,No,No,No,No,No,No,No,No,Unknown,Yes,Yes,Yes,Yes,Unknown,No,No,No,None of these medications,"No, I have not tried to get tested",No,,No,
hu81B385,4/6/2020 13:55:13,1twvwei3oyxya090ucs24e5r2d7n0wgk1qax15wjxqky9bvls7,No,Yes,No,No,No,No,Yes,No,No,No,No,No,No,No,Yes,No,No,No,No,No,No,No,No,Yes,No,No,No,No,Yes,No,No,No,No,No,No,No,Yes,No,No,No,No,Yes,No,No,No,Yes,No,No,No,No,Yes,No,No,No,No,No,No,No,Yes,No,No,No,No,Yes,No,No,No,None of these medications,"No, I have not tried to get tested",No,,No,
huFEC12F,4/6/2020 13:55:17,1vc4xzjxu81egt0azm2rwcwocpmfnwxj1nyy3zjeiaf5ums85v,No,No,,,,,,,,,,,,,,,,,,,,,,Yes,,,,,,,,,,,,,Yes,,,,,,,,,Yes,,,,,,,,,,,,,Yes,,,,,,,,,None of these medications,"No, I have not tried to get tested",No,,No,
hu6BE130,4/6/2020 13:55:51,3b4wbhwg4msknhuovahw940xkiec8re60io210eg3cc19wbpsy,Yes,Yes,No,No,Yes,No,Yes,No,No,No,No,No,No,No,Yes,No,No,No,No,No,No,No,No,Yes,No,No,Yes,No,Yes,No,No,No,No,No,No,No,Yes,No,No,No,No,No,No,No,No,Yes,No,No,Yes,No,Yes,No,No,No,No,No,No,No,Yes,No,No,No,No,No,No,No,No,"Ibuprofen (eg. Advil, Midol, Motrin, Motrin IB, Motrin Migraine Pain, Proprinal), losartan (e.g. Cozaar)","No, I have not tried to get tested",unknown - work in retail part-time,,,
huC14AE1,4/6/2020 13:56:25,1nj4danmfodyz08ak2xuigvb73xlk2jsarkjf9vq0n64fe6pzi,No,No,,,,,,,,,,,,,,,,,,,,,,Yes,No,No,No,No,No,No,No,No,No,No,No,No,Yes,Yes,No,No,No,Yes,No,No,No,Yes,No,No,Yes,No,No,No,No,No,No,No,No,No,Yes,Yes,No,No,No,Yes,No,No,No,None of these medications,"No, I have not tried to get tested",No,,No,
hu74C42F,4/6/2020 13:56:29,x64mcyskewlpxgt86iujcyjqr830e651mexdh6jqepph0a1pr,Yes,No,,,,,,,,,,,,,,,,,,,,,,Yes,No,No,No,No,Yes,No,Yes,No,Yes,No,Yes,No,Yes,No,No,No,No,No,No,No,No,Yes,Yes,No,No,No,Yes,No,Yes,No,Yes,No,Yes,No,Yes,No,No,No,No,No,No,No,No,None of these medications,"No, I tried to get tested but could not get a test",Don't know,,,
huADB564,4/6/2020 13:56:38,56n6ss4r7ktz676puuidbw7dxiehmrqc0i4euou8bkppndzxbm,No,No,,,,,,,,,,,,,,,,,,,,,,No,,,,,,,,,,,,,,,,,,,,,,No,,,,,,,,,,,,,,,,,,,,,,None of these medications,"No, I have not tried to get tested",No,,No,
hu7ECB9C,4/6/2020 13:57:11,4k6w3hz6vbzlhfx9c7tdtwxbezwcguwjf9cq9cepklnlv59t3s,Yes,No,,,,,,,,,,,,,,,,,,,,,,No,,,,,,,,,,,,,,,,,,,,,,No,,,,,,,,,,,,,,,,,,,,,,None of these medications,"No, I have not tried to get tested",No,,No,
hu52B7E5,4/6/2020 13:57:14,2e9hknz4ns7pe665ugtxnp8coiumrd5zi3oq3fi5pdnu47mi6s,No,No,,,,,,,,,,,,,,,,,,,,,,Yes,No,No,No,No,No,No,No,No,No,No,No,No,Yes,No,No,No,No,Yes,No,No,No,Yes,No,No,No,No,No,No,No,No,No,No,No,No,Yes,No,No,No,No,Yes,No,No,No,None of these medications,"No, I have not tried to get tested",No,,No,
hu4B1A63,4/6/2020 13:57:41,10py3jm8f7pdwvzpj5cif5fd3b1ra1svfv8fzs26wgws8r1xfy,No,No,,,,,,,,,,,,,,,,,,,,,,No,,,,,,,,,,,,,,,,,,,,,,No,,,,,,,,,,,,,,,,,,,,,,None of these medications,"No, I have not tried to get tested",No,,No,