Participant,Timestamp,Please do not change. This field is auto-populated by the PGP and identifies which participant you are.,Are you currently ill with a cold or flu-like illness? ,Currently are you experiencing ANY of the above list of symptoms?,"Indicate which of the following symptoms you are currently experiencing.   [Persistent high fever of 38°C (100.4°F) or higher, lasting for a day or more]","Indicate which of the following symptoms you are currently experiencing.   [Feeling cold, chills or shivers]",Indicate which of the following symptoms you are currently experiencing.   [Headache],Indicate which of the following symptoms you are currently experiencing.   [Aches all over the body],Indicate which of the following symptoms you are currently experiencing.   [Cough],Indicate which of the following symptoms you are currently experiencing.   [Rapid breathing],Indicate which of the following symptoms you are currently experiencing.   [Shortness of breath],Indicate which of the following symptoms you are currently experiencing.   [Wheezing or chest tightness],Indicate which of the following symptoms you are currently experiencing.   [Persistent pain or pressure in the chest],Indicate which of the following symptoms you are currently experiencing.   [Bluish lips or face],Indicate which of the following symptoms you are currently experiencing.   [Dizziness],Indicate which of the following symptoms you are currently experiencing.   [Confusion or inability to arouse],Indicate which of the following symptoms you are currently experiencing.   [Running nose],Indicate which of the following symptoms you are currently experiencing.   [Sore throat],Indicate which of the following symptoms you are currently experiencing.   [Nausea],Indicate which of the following symptoms you are currently experiencing.   [Vomiting],Indicate which of the following symptoms you are currently experiencing.   [Abdominal Pain],Indicate which of the following symptoms you are currently experiencing.   [Diarrhea],Indicate which of the following symptoms you are currently experiencing.   [Pink eye (conjunctivitis)],Indicate which of the following symptoms you are currently experiencing.   [Loss of sense of smell],Indicate which of the following symptoms you are currently experiencing.   [Loss of sense of taste],"In the past two weeks, have you experienced ANY of the above list of symptoms?","In the past 2 weeks,  which symptoms have you experienced. [Persistent high fever of 38°C (100.4°F) or higher, lasting for a day or more]","In the past 2 weeks,  which symptoms have you experienced. [Feeling cold, chills or shivers]","In the past 2 weeks,  which symptoms have you experienced. [Headache]","In the past 2 weeks,  which symptoms have you experienced. [Aches all over the body]","In the past 2 weeks,  which symptoms have you experienced. [Cough]","In the past 2 weeks,  which symptoms have you experienced. [Rapid breathing]","In the past 2 weeks,  which symptoms have you experienced. [Shortness of breath]","In the past 2 weeks,  which symptoms have you experienced. [Wheezing or chest tightness]","In the past 2 weeks,  which symptoms have you experienced. [Persistent pain or pressure in the chest]","In the past 2 weeks,  which symptoms have you experienced. [Bluish lips or face]","In the past 2 weeks,  which symptoms have you experienced. [Dizziness]","In the past 2 weeks,  which symptoms have you experienced. [Confusion or inability to arouse]","In the past 2 weeks,  which symptoms have you experienced. [Running nose]","In the past 2 weeks,  which symptoms have you experienced. [Sore throat]","In the past 2 weeks,  which symptoms have you experienced. [Nausea]","In the past 2 weeks,  which symptoms have you experienced. [Vomiting]","In the past 2 weeks,  which symptoms have you experienced. [Abdominal pain]","In the past 2 weeks,  which symptoms have you experienced. [Diarrhea]","In the past 2 weeks,  which symptoms have you experienced. [Pink eye (conjunctivitis)]","In the past 2 weeks,  which symptoms have you experienced. [Loss of sense of smell]","In the past 2 weeks,  which symptoms have you experienced. [Loss of sense of taste]",Are you regularly taking any of the following medications? Please choose all those that apply.,Have you been tested for coronavirus (COVID-19) by a medical doctor or other official testing service?,"In the past 4 weeks, have you been in close contact with a person who has tested positive for coronavirus (COVID-19)?",How long ago was your contact with a person who has tested positive for coronavirus (COVID-19)?,"In the past 4 weeks, have you been in close contact with a person who has symptoms consistent with coronavirus (COVID-19) but has not been tested?",How long ago was your contact with a person who has symptoms consistent with coronavirus (COVID-19) but has not been tested?
hu34D5B9,5/26/2020 20:50:55,6d7t5vjjau2idjimycmgy7kpro3uzqm03hv3109ilb1mma3w1t,No,No,,,,,,,,,,,,,,,,,,,,,,No,,,,,,,,,,,,,,,,,,,,,,None of these medications,"Yes, and the test was negative for coronavirus (COVID-19)",No,,No,
huB1F492,5/27/2020 16:40:41,19skngztm6t23wgilf156ny0zigjbsis9uhwakobk7ab1id6h2,No,No,,,,,,,,,,,,,,,,,,,,,,No,,,,,,,,,,,,,,,,,,,,,,None of these medications,"No, I have not tried to get tested",No,,No,
huDDCF88,5/27/2020 16:41:18,4nxpxjzqaujsdazcodc6se5pid35lyyzsotwqd6ycwxjxjzyfi,No,No,,,,,,,,,,,,,,,,,,,,,,No,,,,,,,,,,,,,,,,,,,,,,None of these medications,"No, I have not tried to get tested",No,,No,
huBCFE8E,5/27/2020 16:41:39,5i7zgntb76ukff2rzbykkdds4h61pyggxgvtsk1jotm7t35t4f,No,No,,,,,,,,,,,,,,,,,,,,,,No,,,,,,,,,,,,,,,,,,,,,,"Celebrex, Lisinopril","No, I have not tried to get tested",No,,No,
hu34D5B9,5/27/2020 16:42:12,367j2bh3o12n659oq7zo4vf0j93iwr7rrazgpt04k9ffhag2og,No,No,,,,,,,,,,,,,,,,,,,,,,No,,,,,,,,,,,,,,,,,,,,,,None of these medications,"Yes, and the test was negative for coronavirus (COVID-19)",No,,No,
hu7D0E75,5/27/2020 16:42:17,5ij0vavrpy744chvu67moxvf1i7ofcter6bjtyfji3lpc2tcma,No,No,,,,,,,,,,,,,,,,,,,,,,No,,,,,,,,,,,,,,,,,,,,,,None of these medications,"No, I have not tried to get tested",No,,No,
hu826BC6,5/27/2020 16:42:51,2rrfgv9nixkwax4yyzdnx1imh02sd6n0dn8a85tb0nnnrc0shc,No,No,,,,,,,,,,,,,,,,,,,,,,No,,,,,,,,,,,,,,,,,,,,,,None of these medications,"No, I have not tried to get tested",No,,No,
huA9A9EE,5/27/2020 16:43:19,2822rqwvsid8ldvqkl3a6vz2ilvpireiqp8wwlg0adfnhb1wzm,No,No,,,,,,,,,,,,,,,,,,,,,,No,,,,,,,,,,,,,,,,,,,,,,None of these medications,"Yes, and the test was negative for coronavirus (COVID-19)",No,,No,
hu8D8CFA,5/27/2020 16:43:20,5y4h0gdsrjx1b5k3fsbbjhk0fgq8q8ffc5x9qf4kdjwvbdab35,No,No,,,,,,,,,,,,,,,,,,,,,,No,,,,,,,,,,,,,,,,,,,,,,None of these medications,"No, I have not tried to get tested",No,,No,
huBEA3C8,5/27/2020 16:43:40,t2ndns7puy8jpjp1hhnxh1kag6x60bx0eny0fyu6j2eoxhbqx,No,No,,,,,,,,,,,,,,,,,,,,,,No,,,,,,,,,,,,,,,,,,,,,,None of these medications,"No, I have not tried to get tested",No,,No,
hu502084,5/27/2020 16:44:02,1rrp2ynpmye7q0l1h5nuadyz29ti4xhsaycvhpjqeu35askp8c,No,No,,,,,,,,,,,,,,,,,,,,,,No,,,,,,,,,,,,,,,,,,,,,,None of these medications,"No, I have not tried to get tested",No,,No,
huCDF1B0,5/27/2020 16:44:10,2l64re0he7pslzrrgc2mje3hwcayvan4xl95s4bcyerraw2i0o,No,No,,,,,,,,,,,,,,,,,,,,,,No,,,,,,,,,,,,,,,,,,,,,,None of these medications,"No, I have not tried to get tested",No,,No,
hu886B5A,5/27/2020 16:44:46,2s9fs2guokr2rn3nqz0puz7xep4ao0nnjyvjv9kikswfjfv9wt,No,Yes,No,No,No,No,Yes,No,No,No,No,No,No,No,No,No,No,No,No,No,No,No,No,,,,,,,,,,,,,,,,,,,,,,,None of these medications,"No, I have not tried to get tested",No,,No,
hu05F442,5/27/2020 16:45:39,3mmxz6u9t4orporxmkusyrs02o6v7qy39febx3ohje0qiipm80,No,No,,,,,,,,,,,,,,,,,,,,,,No,,,,,,,,,,,,,,,,,,,,,,None of these medications,"No, I have not tried to get tested",No,,No,
huF23B36,5/27/2020 16:45:40,6bhvlk1a1rru8du8avzq2p1asaxi2onuhhjtbqhakhk1t1ecdu,No,No,,,,,,,,,,,,,,,,,,,,,,No,,,,,,,,,,,,,,,,,,,,,,None of these medications,"No, I have not tried to get tested",No,,No,
hu29CF50,5/27/2020 16:46:15,5skfrcn42ogvp4vk2cn60yjk47f90lzfn0y4vydbgfrobf7vet,No,No,,,,,,,,,,,,,,,,,,,,,,No,,,,,,,,,,,,,,,,,,,,,,None of these medications,"No, I have not tried to get tested",No,,No,
hu5D0BAB,5/27/2020 16:46:50,1suxf0q8095nhakz7d35w220lyyf2dx8icqiro98tclrywjh9u,No,No,,,,,,,,,,,,,,,,,,,,,,No,,,,,,,,,,,,,,,,,,,,,,None of these medications,"No, I have not tried to get tested",No,,No,
hu566AA7,5/27/2020 16:47:11,5g2zddfkpqcopjuiiy9ocj47o7rzfgekr99bipu3es7f8fgvus,No,No,,,,,,,,,,,,,,,,,,,,,,No,,,,,,,,,,,,,,,,,,,,,,Famciclovir,"Yes, and the test was negative for coronavirus (COVID-19)",No,,No,
huDD642E,5/27/2020 16:47:18,3ryespkn2khi0z6gh35iivy0lrui96u3xtt3g9nf5plf8xdwd2,No,No,,,,,,,,,,,,,,,,,,,,,,No,,,,,,,,,,,,,,,,,,,,,,"Vit D-2 Cap(ergocal)1.25mg 50,000U weekly","No, I have not tried to get tested",No,,No,
hu15402B,5/27/2020 16:47:26,5gn5nhnau1fzzpff55opyrs590hs5h91reb3a9lnennlfyvdvp,No,No,,,,,,,,,,,,,,,,,,,,,,No,,,,,,,,,,,,,,,,,,,,,,None of these medications,"No, I have not tried to get tested",No,,No,
hu551961,5/27/2020 16:48:49,5454thhbew7j1gxcieoo4j1eab9uikfsjqv78ine9qmt3k3mjt,No,No,,,,,,,,,,,,,,,,,,,,,,No,,,,,,,,,,,,,,,,,,,,,,None of these medications,"No, I have not tried to get tested",No,,No,
hu1B23C3,5/27/2020 16:49:35,31447wquy8e59ggndtmf00b4gecg05dl0uqfntb97naw9k3wqs,No,Yes,No,No,No,No,No,No,No,No,No,No,No,No,Yes,No,No,No,No,No,No,No,No,Yes,No,No,No,No,No,No,No,No,No,No,No,No,Yes,No,No,No,No,Yes,No,No,No,None of these medications,"No, I have not tried to get tested",No,,Don't know,
hu81B385,5/27/2020 16:49:36,2amyfooy0tppxisury93b9h0ndi7j0vdm8rhig3rt4dio0d7z8,No,Yes,No,No,No,No,Yes,No,No,No,No,No,Yes,No,No,No,No,No,No,No,No,No,No,Yes,No,No,No,No,Yes,No,No,No,No,No,Yes,No,No,No,No,No,No,No,No,No,No,None of these medications,"No, I have not tried to get tested",No,,No,
hu2C1D94,5/27/2020 16:50:18,3epz4u610ph6dg7a8706ukb3dn6e449s3t9eg7qfxyjhacpczq,No,No,,,,,,,,,,,,,,,,,,,,,,No,,,,,,,,,,,,,,,,,,,,,,None of these medications,"No, I have not tried to get tested",No,,No,
huE77B10,5/27/2020 16:50:20,3s8t3s1e4zn5n3y6wjmyjb6phcwi8jtqflpvx8umwl3ivf34r4,No,No,,,,,,,,,,,,,,,,,,,,,,No,,,,,,,,,,,,,,,,,,,,,,None of these medications,"No, I have not tried to get tested",No,,No,
huFD37C8,5/27/2020 16:50:40,ki8qu7mqohzl4uqpop36xwez4y9sm4i0zf99t1wgzb8zl3ebl,No,No,,,,,,,,,,,,,,,,,,,,,,No,,,,,,,,,,,,,,,,,,,,,,None of these medications,"Yes, and the test was negative for coronavirus (COVID-19)",No,,No,
huADB564,5/27/2020 16:50:48,6b5m0dh1pf0c3huyckubxchzxi7eremye0q3q8y87a6314jfrx,No,No,,,,,,,,,,,,,,,,,,,,,,No,,,,,,,,,,,,,,,,,,,,,,None of these medications,"No, I have not tried to get tested",No,,No,
huA84F63,5/27/2020 16:51:14,1whnuw3hp5j3soiohq8gdc80bbtn0crln06sseldvhhpyypm7i,Yes,Yes,No,Yes,No,Yes,Yes,No,No,Yes,No,No,No,No,Yes,Yes,No,No,No,No,No,No,No,Yes,No,Yes,Yes,Yes,Yes,No,No,Yes,Yes,No,,No,Yes,Yes,No,No,No,Yes,No,No,No,None of these medications,"Yes, and the test was negative for coronavirus (COVID-19)",No,,No,
hu40FAEA,5/27/2020 16:51:36,2smfffx2i1cl4q4bd0ir74dqzmxiqb62k8gnvnuqafe5ufglu9,No,No,,,,,,,,,,,,,,,,,,,,,,No,,,,,,,,,,,,,,,,,,,,,,None of these medications,"No, I have not tried to get tested",No,,No,
huA136B9,5/27/2020 16:51:48,2muotvrn5qg3w5wlcxemah12ni9ye55y4cjonedqqe26ix7og5,No,No,,,,,,,,,,,,,,,,,,,,,,No,,,,,,,,,,,,,,,,,,,,,,None of these medications,"No, I have not tried to get tested",No,,No,
hu37F1F7,5/27/2020 16:52:47,1l0j5lo08hadtxp2cmuc8tcvqu6ags6zwyku7unhi8afb40u1b,No,No,,,,,,,,,,,,,,,,,,,,,,Yes,No,No,Yes,No,Yes,No,Yes,Yes,No,No,No,No,No,No,Yes,No,No,Yes,No,No,No,None of these medications,"No, I have not tried to get tested",No,,No,
huA74FEA,5/27/2020 16:54:54,17bf1qz39v2bnhvu25ltaq1a6fpn7oyaortc67f3buv6cbzh1x,No,No,,,,,,,,,,,,,,,,,,,,,,No,,,,,,,,,,,,,,,,,,,,,,None of these medications,"Yes, and the test was negative for coronavirus (COVID-19)",No,,No,
hu85F3ED,5/27/2020 16:55:22,3zifoxzf2s21zuewcwze55del9dmy4yfmka3j2v636gp08kal0,No,Yes,No,No,Yes,Yes,No,No,No,No,No,No,No,No,No,No,No,No,No,Yes,No,No,No,Yes,No,No,Yes,Yes,No,No,No,No,No,No,No,No,No,No,No,No,Yes,Yes,No,No,No,None of these medications,"No, I tried to get tested but could not get a test",No,,No,
huB3A31B,5/27/2020 16:55:22,31g6wm52t4zdtb2rq0xqmllgg20mm169r6gj7vb5fhhijc0h4j,No,No,,,,,,,,,,,,,,,,,,,,,,Yes,No,No,Yes,No,No,No,No,No,No,No,No,No,No,No,No,No,No,No,No,No,No,,"No, I have not tried to get tested",No,,No,
huAF3C63,5/27/2020 16:55:37,4apmn3welptgeubpdg6d7wof6a6xyktb1yt8o69o510mfow6u2,No,No,,,,,,,,,,,,,,,,,,,,,,No,,,,,,,,,,,,,,,,,,,,,,None of these medications,"No, I have not tried to get tested",No,,No,
hu399FC0,5/27/2020 16:56:07,1ziu15womqso3i9fh4k7l7be5b4m3v10m4x79bqqsi9gfd4jzf,No,No,,,,,,,,,,,,,,,,,,,,,,Yes,No,No,No,No,No,No,No,No,No,No,No,No,Yes,No,No,No,No,No,No,No,No,None of these medications,"No, I have not tried to get tested",No,,No,
hu0BCA45,5/27/2020 16:58:02,25kdyy3g6gmgndoz6a6xnm4rwwmrd2ktvqq2xs10b0diur2znr,No,No,,,,,,,,,,,,,,,,,,,,,,No,,,,,,,,,,,,,,,,,,,,,,None of these medications,"No, I have not tried to get tested",No,,No,
hu15E54C,5/27/2020 16:58:32,69pdjo3phcxi2rf8bouz8r0zvf9u0k1lgnmhncl6gghrhma567,No,No,,,,,,,,,,,,,,,,,,,,,,No,,,,,,,,,,,,,,,,,,,,,,None of these medications,"Yes, and the test was negative for coronavirus (COVID-19)","I don’t know but work every day with the general public, as an essential worker. ",,,
hu264A0A,5/27/2020 16:58:33,2xy6cfbcxghy523g9t4grmkax7me0596bzx0cfoqaajc636lvb,No,No,,,,,,,,,,,,,,,,,,,,,,No,,,,,,,,,,,,,,,,,,,,,,None of these medications,"No, I have not tried to get tested",No,,No,
hu2EA6EA,5/27/2020 16:58:53,4iiryniewv6mhs58gg3narir6bncr5btmzvc9ptz9dmas3zm8q,No,No,,,,,,,,,,,,,,,,,,,,,,No,,,,,,,,,,,,,,,,,,,,,,None of these medications,"No, I have not tried to get tested",No,,No,
hu433D3A,5/27/2020 17:00:36,5n0vlyay977anhfs5v8bn1qp3587f9nu42z608jyncuuj490s8,No,No,,,,,,,,,,,,,,,,,,,,,,No,,,,,,,,,,,,,,,,,,,,,,None of these medications,"No, I have not tried to get tested",No,,No,
hu0D1FA1,5/27/2020 17:01:58,b53uyddtwjfsfrtq0txwb66n2earrkwd7v367xx6ushqp455,No,No,,,,,,,,,,,,,,,,,,,,,,No,,,,,,,,,,,,,,,,,,,,,,None of these medications,"No, I have not tried to get tested",No,,No,
hu6E05B2,5/27/2020 17:02:26,4lys80vn5ce6jpwtojoctr1244ua06u8v0e18non3q313106po,No,No,,,,,,,,,,,,,,,,,,,,,,Yes,No,No,No,No,No,No,No,No,No,No,No,No,Yes,No,No,No,No,No,No,No,No,"doxycycline, atorvastatin, soolantra","No, I have not tried to get tested",No,,No,
huB5A0DF,5/27/2020 17:03:56,3dh7ix6qrqbmoezdwv1prkdvpxss2goucwr5v55i25gparljo5,No,Yes,No,No,Yes,No,No,No,No,No,No,No,No,No,No,No,No,No,No,No,No,No,No,Yes,No,No,Yes,No,No,No,No,No,No,No,No,No,No,No,No,No,No,No,No,No,No,None of these medications,"No, I have not tried to get tested",No,,No,
huD75A2E,5/27/2020 17:04:56,35k1gi7m7dxv5cin1ympmuevzweo36k1sfew0003mjv77c9oz0,No,No,,,,,,,,,,,,,,,,,,,,,,No,,,,,,,,,,,,,,,,,,,,,,None of these medications,"No, I have not tried to get tested",No,,No,
hu2FEC01,5/27/2020 17:05:31,3ko1o7atqkhum3g0t32jhmzzc6dzixvu8rpepodsguylquz7h1,No,No,,,,,,,,,,,,,,,,,,,,,,No,,,,,,,,,,,,,,,,,,,,,,None of these medications,"No, I have not tried to get tested",No,,No,
huAAF706,5/27/2020 17:05:57,219ros81ttkl2mk9x7xqgrnjahjw767yhuro8eiubmqg583dp9,No,No,,,,,,,,,,,,,,,,,,,,,,No,,,,,,,,,,,,,,,,,,,,,,None of these medications,"No, I have not tried to get tested",No,,No,
huEE0062,5/27/2020 17:06:47,30n9um1fkgtjjznov45of8u3qneojjgje4vk270t9dk5fx5ne1,No,No,,,,,,,,,,,,,,,,,,,,,,No,,,,,,,,,,,,,,,,,,,,,,None of these medications,"No, I have not tried to get tested",No,,No,
hu0313A3,5/27/2020 17:07:35,2n798053y5zrg4ierwsrpw2fr0fs20er3kkv1itlrshj38qsi9,No,No,,,,,,,,,,,,,,,,,,,,,,No,,,,,,,,,,,,,,,,,,,,,,None of these medications,"Yes, and the test was negative for coronavirus (COVID-19)",No,,No,
huE24522,5/27/2020 17:08:57,42zgpu6tf6c4plp4bkua1il38tx1qnxbo3hl7i28t95utbwxc4,No,No,,,,,,,,,,,,,,,,,,,,,,No,,,,,,,,,,,,,,,,,,,,,,None of these medications,"No, I have not tried to get tested",No,,No,
hu8A6018,5/27/2020 17:11:55,5u3rii01ds6a9sxddcaxdejgmye1n1zsskjubdqmbpbwwy9l1o,No,No,,,,,,,,,,,,,,,,,,,,,,No,,,,,,,,,,,,,,,,,,,,,,Olmesartan (e.g. Benicar),"No, I have not tried to get tested",No,,No,
hu6CC83D,5/27/2020 17:12:06,2fotjjsk7k79u6xrg6ebkyct5af6bydqq8yclb5rmlwqzm15x2,No,No,,,,,,,,,,,,,,,,,,,,,,No,,,,,,,,,,,,,,,,,,,,,,,"No, I have not tried to get tested",No,,No,
hu70DE1D,5/27/2020 17:12:29,1fonv8n23haom57x9v9pt6jmf7e1g6yksa7ec8nakza7nrjhkd,No,No,,,,,,,,,,,,,,,,,,,,,,No,,,,,,,,,,,,,,,,,,,,,,,"No, I have not tried to get tested",No,,No,
hu948494,5/27/2020 17:12:39,46n0e1p3efukuxl85ecthlepojuwazttxzohdne5k6p6nvb18b,No,No,,,,,,,,,,,,,,,,,,,,,,No,,,,,,,,,,,,,,,,,,,,,,None of these medications,"No, I have not tried to get tested",No,,No,
hu8229AE,5/27/2020 17:13:06,51fzhe5yuxy9t3gsdx3sfe0z3g1fdqppr181hvbfbe3zbfu74o,No,No,,,,,,,,,,,,,,,,,,,,,,No,,,,,,,,,,,,,,,,,,,,,,None of these medications,"No, I have not tried to get tested",No,,No,
huFFB09D,5/27/2020 17:14:29,6a52g3zb5m6on9j5pdoho02kep0qy1n8g4ix8bloe6womvbzty,No,No,,,,,,,,,,,,,,,,,,,,,,No,,,,,,,,,,,,,,,,,,,,,,None of these medications,"No, I have not tried to get tested",No,,No,
hu6E8157,5/27/2020 17:15:18,4m4evqynqj0clf8ctkcdk5rz8jgbw09n2wu8gq21onik74qh0c,No,No,,,,,,,,,,,,,,,,,,,,,,No,,,,,,,,,,,,,,,,,,,,,,None of these medications,"Yes, but still waiting for test results to be returned",No,,No,
hu3B8226,5/27/2020 17:16:26,x90cpz9rj7rz9c0c1qzy1dw8j1hrqe4chz9xxklmw7p3ms3od,No,No,,,,,,,,,,,,,,,,,,,,,,No,,,,,,,,,,,,,,,,,,,,,,None of these medications,"No, I have not tried to get tested",No,,No,
huD20DAF,5/27/2020 17:17:22,2zo3yz28n9b82s6coyfmkh5aryyf5vufs683lnth8bbyxtrh33,No,No,,,,,,,,,,,,,,,,,,,,,,No,,,,,,,,,,,,,,,,,,,,,,"Estrogen, ambien","No, I have not tried to get tested",No,,No,
huB0EB81,5/27/2020 17:18:52,4ly353wildwxn7ssmk6fanz3lsf6erogcxovos7lpkxa027x2w,No,No,,,,,,,,,,,,,,,,,,,,,,No,,,,,,,,,,,,,,,,,,,,,,None of these medications,"No, I have not tried to get tested",No,,No,
hu26F962,5/27/2020 17:19:58,pmttbi49ffkxiawfgh88yfspk78l26m7hdh6lertt7cbkkhtr,No,No,,,,,,,,,,,,,,,,,,,,,,No,,,,,,,,,,,,,,,,,,,,,,None of these medications,"No, I have not tried to get tested",No,,No,
hu3C8DE9,5/27/2020 17:21:26,6rjqhqb7ov54zocfz46j0x10e0vbfy2hqill96bpcogkposyd,No,No,,,,,,,,,,,,,,,,,,,,,,No,,,,,,,,,,,,,,,,,,,,,,None of these medications,"Yes, and the test was negative for coronavirus (COVID-19)",No,,No,
hu5BB600,5/27/2020 17:21:27,2g07a5j332xxusi8t3zywmvdcl2kc47jy9mpwk6w4whcj45slh,No,No,,,,,,,,,,,,,,,,,,,,,,No,,,,,,,,,,,,,,,,,,,,,,None of these medications,"No, I have not tried to get tested",No,,No,
hu9408BD,5/27/2020 17:21:29,30cgb3x7euyqlmb32tg4ep156psldfxl3gfr2s49ropb0cnnbh,No,No,,,,,,,,,,,,,,,,,,,,,,No,,,,,,,,,,,,,,,,,,,,,,None of these medications,"No, I have not tried to get tested",No,,No,
huCDD5EE,5/27/2020 17:23:31,3fw0knvh4uoc34t7ldwntlpdikkws3799xrtk95zeqzlnc05mt,No,No,,,,,,,,,,,,,,,,,,,,,,No,,,,,,,,,,,,,,,,,,,,,,None of these medications,"No, I have not tried to get tested",No,,No,
hu065B67,5/27/2020 17:23:55,5zwnc46ueztcf7441o6m27cqo753ub7s6t3zwub625govy7zvc,No,No,,,,,,,,,,,,,,,,,,,,,,Yes,No,No,Yes,No,No,No,No,No,No,No,No,No,No,Yes,No,No,No,No,No,No,No,None of these medications,"No, I have not tried to get tested",No,,No,
hu6D1115,5/27/2020 17:28:32,nnriid57u83n1cebt7ooo3b0zca5le8sxj7t1tcyljty4xhlx,No,No,,,,,,,,,,,,,,,,,,,,,,No,,,,,,,,,,,,,,,,,,,,,,None of these medications,"No, I have not tried to get tested",No,,No,
huB57DD1,5/27/2020 17:29:09,5fcvdei8aoyimfzws3idsyl06fd5ytv80rbcanwsab2zi5by0f,No,No,,,,,,,,,,,,,,,,,,,,,,No,,,,,,,,,,,,,,,,,,,,,,None of these medications,"No, I have not tried to get tested",No,,No,
hu6B7829,5/27/2020 17:30:23,4kpgcad2y2p2w6lick08ykpwlapjc2zvrk3okog0gsay7kqo33,No,Yes,No,No,Yes,No,No,No,No,No,No,No,No,No,Yes,No,No,No,No,No,No,No,No,Yes,No,No,Yes,No,No,No,No,No,No,No,No,No,Yes,No,No,No,No,No,No,No,No,"Ibuprofen (eg. Advil, Midol, Motrin, Motrin IB, Motrin Migraine Pain, Proprinal)","No, I tried to get tested but could not get a test",No,,No,
hu2CF1D1,5/27/2020 17:31:45,2646asxaqxtn026biqvacdsp8l3c8pmvwk6wqwzz11lx63jpsp,No,No,,,,,,,,,,,,,,,,,,,,,,No,,,,,,,,,,,,,,,,,,,,,,None of these medications,"No, I have not tried to get tested",No,,No,
hu126A05,5/27/2020 17:31:57,5kv1j19v0fag5o4x95l5zjimzfr222btlw658twijcjlz2c6xk,No,No,,,,,,,,,,,,,,,,,,,,,,No,,,,,,,,,,,,,,,,,,,,,,None of these medications,"No, I have not tried to get tested",No,,No,
hu18460C,5/27/2020 17:32:13,3tdfj0cnge7exvhdblm0dx2xufs8qgmmsmpj1l9okqlj1qtumv,No,No,,,,,,,,,,,,,,,,,,,,,,No,,,,,,,,,,,,,,,,,,,,,,,"Yes, and the test was negative for coronavirus (COVID-19)",No,,No,
huDEDF57,5/27/2020 17:32:16,5m8fanbvy3p332uzenkdipj48nms4u0ffrabqot93kvrr7z9fg,No,No,,,,,,,,,,,,,,,,,,,,,,No,,,,,,,,,,,,,,,,,,,,,,None of these medications,"Yes, and the test was negative for coronavirus (COVID-19)",No,,No,
huD121DF,5/27/2020 17:34:15,55yx7g774gi4aer377lyjipibgaw7fvt3j4wi6g5ps29iwr709,No,No,,,,,,,,,,,,,,,,,,,,,,No,,,,,,,,,,,,,,,,,,,,,,None of these medications,"No, I have not tried to get tested",No,,No,
hu1466F9,5/27/2020 17:34:19,6bs2evq13h2cixzg8hlbf18i8d82lw5r7lovu9ug7xuegkxkhp,No,No,,,,,,,,,,,,,,,,,,,,,,No,,,,,,,,,,,,,,,,,,,,,,None of these medications,"No, I have not tried to get tested",No,,No,
hu96D41E,5/27/2020 17:35:36,2evbw9oovzenaao4p9n3hmuojplzl9kcd6kp02n1p2wo7zdqtu,No,No,,,,,,,,,,,,,,,,,,,,,,No,,,,,,,,,,,,,,,,,,,,,,None of these medications,"No, I have not tried to get tested",No,,No,
hu8A5FBF,5/27/2020 17:36:02,3e5m9uqqy5arb495xw0wvzg5t2756eefqth9ssoy3mj4qffuf3,No,No,,,,,,,,,,,,,,,,,,,,,,No,,,,,,,,,,,,,,,,,,,,,,None of these medications,"No, I have not tried to get tested",No,,No,
huE778FA,5/27/2020 17:36:13,5rc22e6eej0drg3d1npbjnnmwu8gccw4a54vzvd0axpq0jerla,No,No,,,,,,,,,,,,,,,,,,,,,,No,,,,,,,,,,,,,,,,,,,,,,None of these medications,"No, I have not tried to get tested",No,,No,
huA2961E,5/27/2020 17:36:15,69l8mvxg8j81l9uo7ms04lvtscwzx5uxtrbbgew2p6g9wj47j7,No,No,,,,,,,,,,,,,,,,,,,,,,No,,,,,,,,,,,,,,,,,,,,,,losartan (e.g. Cozaar),"No, I have not tried to get tested",No,,No,
huAB8707,5/27/2020 17:36:28,5le4vuv8e2w8mhrdhmor9cywf4p87y6j1list55ntulb5axk3v,No,No,,,,,,,,,,,,,,,,,,,,,,No,,,,,,,,,,,,,,,,,,,,,,None of these medications,"No, I have not tried to get tested",No,,No,
hu4664CE,5/27/2020 17:37:22,2v4ywksiyuzc80l3ufeao2pwrcp1k73mtjtl6gqjxl0p315bra,No,No,,,,,,,,,,,,,,,,,,,,,,No,,,,,,,,,,,,,,,,,,,,,,None of these medications,"No, I have not tried to get tested",No,,No,
huBE835D,5/27/2020 17:38:57,71hi3cpk7o4c7tgvffa83jv6g6l0e9ory53ukaxk6oyw2dm5o,No,No,,,,,,,,,,,,,,,,,,,,,,No,,,,,,,,,,,,,,,,,,,,,,"None of these medications, Hydrochlorot (HCTZ) 25 mg daily - - - Atovastatin 40 mg daily","No, I have not tried to get tested","Don't know, but unlikely",,,
huA720D3,5/27/2020 17:39:02,40id3t6gepkidjmpzi65h9hjy7oz7wthh3kta7mr640u4mz05t,No,No,,,,,,,,,,,,,,,,,,,,,,No,,,,,,,,,,,,,,,,,,,,,,"Ibuprofen (eg. Advil, Midol, Motrin, Motrin IB, Motrin Migraine Pain, Proprinal), losartan (e.g. Cozaar)","No, I have not tried to get tested",No,,No,
hu28C432,5/27/2020 17:41:40,2h2kq5fm3os9jvs5ptp4f93cdcypthiqpd6ruylt9wraqx2rrs,No,No,,,,,,,,,,,,,,,,,,,,,,No,,,,,,,,,,,,,,,,,,,,,,None of these medications,"No, I have not tried to get tested",No,,No,
hu2FBC1E,5/27/2020 17:48:52,3b8hwy7dk0hknsqh8ikii8oidiazjqayfbdbus54bhvh8548q1,Unknown,Yes,No,No,No,No,Yes,No,No,No,No,No,No,No,Yes,No,No,No,No,No,No,No,No,Yes,No,No,No,No,Yes,No,No,No,No,No,No,No,Yes,No,No,No,,Yes,No,No,No,None of these medications,"Yes, and the test was negative for coronavirus (COVID-19)",No,,Yes,In current contact
hu481B1D,5/27/2020 17:50:31,32fqh4qhzma036xzrhc3g0ccf28msaox3w4skkqxngxjms9bsu,No,No,,,,,,,,,,,,,,,,,,,,,,No,,,,,,,,,,,,,,,,,,,,,,None of these medications,"No, I have not tried to get tested",No,,No,
hu88943B,5/27/2020 17:54:05,40w5dblo79zfznc99sqkf960utsxwk6dcmeqfh9ln6dx6zj1yw,No,No,,,,,,,,,,,,,,,,,,,,,,Yes,No,No,Yes,No,No,No,No,No,No,No,No,No,No,No,Yes,No,Yes,Yes,No,No,No,None of these medications,"No, I have not tried to get tested",No,,No,